Reaction Details
TargetSolute carrier family 15 member 1
LigandBDBM21642
Substrate/Competitorn/a
Meas. Tech.ChEMBL_837091 (CHEMBL2076343)
Ki 8700000±n/a nM
Citation Temple, CSBoyd, CA Proton-coupled oligopeptide transport by rat renal cortical brush border membrane vesicles: a functional analysis using ACE inhibitors to determine the isoform of the transporter. Biochim Biophys Acta1373:277-81 (1998) Solute carrier family 15 member 1
Name:Solute carrier family 15 member 1
Type:PROTEIN
Mol. Mass.:78933.78
Organism:Rattus norvegicus
Description:ChEMBL_1488841
Residue:710
BDBM21642
NameBDBM21642
Synonyms:(2S)-1-[(2S)-2-methyl-3-sulfanylpropanoyl]pyrrolidine-2-carboxylic acid Capozide Lopirin SQ14534 | US11491146, Compound L-Captopril
TypeSmall organic molecule
Emp. Form.C9H15NO3S
Mol. Mass.217.285
SMILESC[C@H](CS)C(=O)N1CCC[C@H]1C(O)=O