Reaction Details
TargetATP-dependent translocase ABCB1
LigandBDBM578
Substrate/Competitorn/a
Meas. Tech.ChEMBL_837070 (CHEMBL2076322)
IC50 1700±n/a nM
Citation Vishnuvardhan, DMoltke, LLRichert, CGreenblatt, DJ Lopinavir: acute exposure inhibits P-glycoprotein; extended exposure induces P-glycoprotein. AIDS17:1092-4 (2003) 
 
ATP-dependent translocase ABCB1
Name:ATP-dependent translocase ABCB1
Type:Protein
Mol. Mass.:141503.50
Organism:Homo sapiens (Human)
Description:P08183
Residue:1280
BDBM578
NameBDBM578
Synonyms:(2S)-N-[(2S,4S,5S)-5-[2-(2,6-dimethylphenoxy)acetamido]-4-hydroxy-1,6-diphenylhexan-2-yl]-3-methyl-2-(2-oxo-1,3-diazinan-1-yl)butanamide Aluviran LPV | Lopinavir
TypeSmall organic molecule
Emp. Form.C37H48N4O5
Mol. Mass.628.8008
SMILESCC(C)[C@H](N1CCCNC1=O)C(=O)N[C@H](C[C@H](O)[C@H](Cc1ccccc1)NC(=O)COc1c(C)cccc1C)Cc1ccccc1