Reaction Details
TargetSolute carrier family 22 member 11
LigandBDBM23432
Substrate/Competitorn/a
Meas. Tech.ChEMBL_836111 (CHEMBL2077547)
Ki 235500±n/a nM
Citation Babu, ETakeda, MNarikawa, SKobayashi, YEnomoto, ATojo, ACha, SHSekine, TSakthisekaran, DEndou, H Role of human organic anion transporter 4 in the transport of ochratoxin A. Biochim Biophys Acta1590:64-75 (2002) Solute carrier family 22 member 11
Name:Solute carrier family 22 member 11
Type:PROTEIN
Mol. Mass.:59982.54
Organism:Homo sapiens (Human)
Description:ChEMBL_838708
Residue:550
BDBM23432
NameBDBM23432
Synonyms:octanoate octanoic acid | octanoic acid-d15
TypeSmall organic molecule
Emp. Form.C8H15O2
Mol. Mass.143.204
SMILESCCCCCCCC([O-])=O