Reaction Details
TargetATP-dependent translocase ABCB1
LigandBDBM50420186
Substrate/Competitorn/a
Meas. Tech.ChEMBL_837616 (CHEMBL2076416)
IC50 20±n/a nM
Citation Choo, EFLeake, BWandel, CImamura, HWood, AJWilkinson, GRKim, RB Pharmacological inhibition of P-glycoprotein transport enhances the distribution of HIV-1 protease inhibitors into brain and testes. Drug Metab Dispos28:655-60 (2000) ATP-dependent translocase ABCB1
Name:ATP-dependent translocase ABCB1
Type:Protein
Mol. Mass.:141503.50
Organism:Homo sapiens (Human)
Description:P08183
Residue:1280
BDBM50420186
NameBDBM50420186
Synonyms:ZOSUQUIDAR | ZOSUQUIDAR TRIHYDROCHLORIDE
TypeSmall organic molecule
Emp. Form.C32H31F2N3O2
Mol. Mass.527.6042
SMILESO[C@@H](COc1cccc2ncccc12)CN1CCN(CC1)[C@@H]1c2ccccc2[C@@H]2[C@H](c3ccccc13)C2(F)F