Reaction Details
TargetATP-dependent translocase ABCB1
LigandBDBM50367298
Substrate/Competitorn/a
Meas. Tech.ChEMBL_838718 (CHEMBL2078544)
IC50 11700±n/a nM
Citation Wang, EJCasciano, CNClement, RPJohnson, WW Active transport of fluorescent P-glycoprotein substrates: evaluation as markers and interaction with inhibitors. Biochem Biophys Res Commun289:580-5 (2001) 
 
ATP-dependent translocase ABCB1
Name:ATP-dependent translocase ABCB1
Type:Protein
Mol. Mass.:141503.50
Organism:Homo sapiens (Human)
Description:P08183
Residue:1280
BDBM50367298
NameBDBM50367298
Synonyms:Cardene | NICARDIPINE
TypeSmall organic molecule
Emp. Form.C26H29N3O6
Mol. Mass.479.525
SMILESCOC(=O)C1C(C(C(=O)OCCN(C)Cc2ccccc2)=C(C)N=C1C)c1cccc(c1)[N+]([O-])=O