Reaction Details
TargetATP-dependent translocase ABCB1
LigandBDBM50367247
Substrate/Competitorn/a
Meas. Tech.ChEMBL_838720 (CHEMBL2078546)
IC50 112400±n/a nM
Citation Wang, EJCasciano, CNClement, RPJohnson, WW Active transport of fluorescent P-glycoprotein substrates: evaluation as markers and interaction with inhibitors. Biochem Biophys Res Commun289:580-5 (2001) 
 
ATP-dependent translocase ABCB1
Name:ATP-dependent translocase ABCB1
Type:Protein
Mol. Mass.:141503.50
Organism:Homo sapiens (Human)
Description:P08183
Residue:1280
BDBM50367247
NameBDBM50367247
Synonyms:QUININE Quinsan | cid_3034034
TypeSmall organic molecule
Emp. Form.C20H24N2O2
Mol. Mass.324.4168
SMILESCOc1ccc2nccc([C@@H](O)[C@@H]3C[C@@H]4CCN3C[C@@H]4C=C)c2c1