Reaction Details
TargetATP-dependent translocase ABCB1
LigandBDBM50017712
Substrate/Competitorn/a
Meas. Tech.ChEMBL_838266 (CHEMBL2076214)
IC50 2100±n/a nM
Citation Wang, EJCasciano, CNClement, RPJohnson, WW Active transport of fluorescent P-glycoprotein substrates: evaluation as markers and interaction with inhibitors. Biochem Biophys Res Commun289:580-5 (2001) 
 
ATP-dependent translocase ABCB1
Name:ATP-dependent translocase ABCB1
Type:Protein
Mol. Mass.:141503.50
Organism:Homo sapiens (Human)
Description:P08183
Residue:1280
BDBM50017712
NameBDBM50017712
Synonyms:(-)-reserpine 3,4,5-trimethoxybenzoyl methyl reserpate CHEMBL772 RESERPINE Serpalan methyl (3beta,16beta,17alpha,18beta,20alpha)-11,17-dimethoxy-18-[(3,4,5-trimethoxybenzoyl)oxy]yohimban-16-carboxylate
TypeSmall organic molecule
Emp. Form.C33H40N2O9
Mol. Mass.608.6787
SMILESCO[C@H]1[C@@H](C[C@@H]2CN3CCc4c([nH]c5cc(OC)ccc45)[C@H]3C[C@@H]2[C@@H]1C(=O)OC)OC(=O)c1cc(OC)c(OC)c(OC)c1