Reaction Details
TargetATP-dependent translocase ABCB1
LigandBDBM50336640
Substrate/Competitorn/a
Meas. Tech.ChEMBL_838292 (CHEMBL2076240)
IC50 113000±n/a nM
Citation Wang, ELew, KBarecki, MCasciano, CNClement, RPJohnson, WW Quantitative distinctions of active site molecular recognition by P-glycoprotein and cytochrome P450 3A4. Chem Res Toxicol14:1596-603 (2001) ATP-dependent translocase ABCB1
Name:ATP-dependent translocase ABCB1
Type:Protein
Mol. Mass.:141503.50
Organism:Homo sapiens (Human)
Description:P08183
Residue:1280
BDBM50336640
NameBDBM50336640
Synonyms:(nifedipine) 2,6-Dimethyl-4-(2-nitro-phenyl)-1,4-dihydro-pyridine-3,5-dicarboxylic acid dimethyl ester Adalat Afeditab cr NIFEDIPINE Procardia dimethyl 2,6-dimethyl-4-(2-nitrophenyl)-1,4-dihydropyridine-3,5-dicarboxylate
TypeSmall organic molecule
Emp. Form.C17H18N2O6
Mol. Mass.346.3346
SMILESCOC(=O)C1C(C(C(=O)OC)=C(C)N=C1C)c1ccccc1[N+]([O-])=O