Reaction Details
TargetATP-dependent translocase ABCB1
LigandBDBM22164
Substrate/Competitorn/a
Meas. Tech.ChEMBL_836603 (CHEMBL2077344)
IC50 271000±n/a nM
Citation Wang, ECasciano, CNClement, RPJohnson, WW HMG-CoA reductase inhibitors (statins) characterized as direct inhibitors of P-glycoprotein. Pharm Res18:800-6 (2001) ATP-dependent translocase ABCB1
Name:ATP-dependent translocase ABCB1
Type:Protein
Mol. Mass.:141503.50
Organism:Homo sapiens (Human)
Description:P08183
Residue:1280
BDBM22164
NameBDBM22164
Synonyms:(3R,5R)-7-[2-(4-fluorophenyl)-3-phenyl-4-(phenylcarbamoyl)-5-(propan-2-yl)-1H-pyrrol-1-yl]-3,5-dihydroxyheptanoic acid Atorvastatin CI 981 US9353061, Atorvastatina
TypeSmall organic molecule
Emp. Form.C33H35FN2O5
Mol. Mass.558.6398
SMILESCC(C)c1c(C(=O)Nc2ccccc2)c(c(-c2ccc(F)cc2)n1CC[C@@H](O)C[C@@H](O)CC(O)=O)-c1ccccc1