Reaction Details
TargetSolute carrier family 22 member 3
LigandBDBM50420192
Substrate/Competitorn/a
Meas. Tech.ChEMBL_836621 (CHEMBL2077362)
IC50 1760±n/a nM
Citation Martel, FGründemann, DCalhau, CSchömig, E Apical uptake of organic cations by human intestinal Caco-2 cells: putative involvement of ASF transporters. Naunyn Schmiedebergs Arch Pharmacol363:40-9 (2001) Solute carrier family 22 member 3
Name:Solute carrier family 22 member 3
Type:PROTEIN
Mol. Mass.:61292.57
Organism:Homo sapiens (Human)
Description:ChEMBL_934315
Residue:556
BDBM50420192
NameBDBM50420192
Synonyms:CHEMBL2074851
TypeSmall organic molecule
Emp. Form.C24H26N3
Mol. Mass.356.4828
SMILESCC[n+]1c(CC2C=C(C)N=C(N2C)c2ccccc2)ccc2ccccc12