Reaction Details
TargetATP-dependent translocase ABCB1
LigandBDBM50368352
Substrate/Competitorn/a
Meas. Tech.ChEMBL_838495 (CHEMBL2076066)
Ki 111000±n/a nM
Citation Tang, FHorie, KBorchardt, RT Are MDCK cells transfected with the human MDR1 gene a good model of the human intestinal mucosa? Pharm Res19:765-72 (2002) ATP-dependent translocase ABCB1
Name:ATP-dependent translocase ABCB1
Type:Protein
Mol. Mass.:141503.50
Organism:Homo sapiens (Human)
Description:P08183
Residue:1280
BDBM50368352
NameBDBM50368352
Synonyms:Cerubidine | DAUNORUBICIN
TypeSmall organic molecule
Emp. Form.C27H29NO10
Mol. Mass.527.5199
SMILESCOc1cccc2C(=O)c3c(O)c4C[C@](O)(C[C@H](O[C@H]5C[C@H](N)[C@H](O)[C@H](C)O5)c4c(O)c3C(=O)c12)C(C)=O