Reaction Details
TargetATP-dependent translocase ABCB1
LigandBDBM50139772
Substrate/Competitorn/a
Meas. Tech.ChEMBL_838495 (CHEMBL2076066)
Ki 213000±n/a nM
Citation Tang, FHorie, KBorchardt, RT Are MDCK cells transfected with the human MDR1 gene a good model of the human intestinal mucosa? Pharm Res19:765-72 (2002) ATP-dependent translocase ABCB1
Name:ATP-dependent translocase ABCB1
Type:Protein
Mol. Mass.:141503.50
Organism:Homo sapiens (Human)
Description:P08183
Residue:1280
BDBM50139772
NameBDBM50139772
Synonyms:22-oxovincaleukoblastine vincristine
TypeSmall organic molecule
Emp. Form.C46H56N4O10
Mol. Mass.824.9576
SMILESCC[C@]1(O)C[C@H]2CN(C1)CCc1c([nH]c3ccccc13)[C@@](C2)(C(=O)OC)c1cc2c(cc1OC)N(C=O)[C@@H]1[C@]22CCN3CC=C[C@](CC)([C@@H]23)[C@@H](OC(C)=O)[C@]1(O)C(=O)OC