Reaction Details
TargetATP-binding cassette sub-family C member 2
LigandBDBM50017712
Substrate/Competitorn/a
Meas. Tech.ChEMBL_838735 (CHEMBL2078561)
Ki 295000±n/a nM
Citation Tang, FHorie, KBorchardt, RT Are MDCK cells transfected with the human MRP2 gene a good model of the human intestinal mucosa? Pharm Res19:773-9 (2002) ATP-binding cassette sub-family C member 2
Name:ATP-binding cassette sub-family C member 2
Type:Protein
Mol. Mass.:174229.45
Organism:Homo sapiens (Human)
Description:Q92887
Residue:1545
BDBM50017712
NameBDBM50017712
Synonyms:(-)-reserpine 3,4,5-trimethoxybenzoyl methyl reserpate CHEMBL772 RESERPINE Serpalan methyl (3beta,16beta,17alpha,18beta,20alpha)-11,17-dimethoxy-18-[(3,4,5-trimethoxybenzoyl)oxy]yohimban-16-carboxylate
TypeSmall organic molecule
Emp. Form.C33H40N2O9
Mol. Mass.608.6787
SMILESCO[C@H]1[C@@H](C[C@@H]2CN3CCc4c([nH]c5cc(OC)ccc45)[C@H]3C[C@@H]2[C@@H]1C(=O)OC)OC(=O)c1cc(OC)c(OC)c(OC)c1