Reaction Details
TargetMultidrug resistance-associated protein 1
LigandBDBM50420229
Substrate/Competitorn/a
Meas. Tech.ChEMBL_837125 (CHEMBL2076526)
IC50 420±n/a nM
Citation Jedlitschky, GLeier, IBuchholz, UHummel-Eisenbeiss, JBurchell, BKeppler, D ATP-dependent transport of bilirubin glucuronides by the multidrug resistance protein MRP1 and its hepatocyte canalicular isoform MRP2. Biochem J327:305-10 (1997) Multidrug resistance-associated protein 1
Name:Multidrug resistance-associated protein 1
Type:n/a
Mol. Mass.:171597.72
Organism:Homo sapiens (Human)
Description:P33527
Residue:1531
BDBM50420229
NameBDBM50420229
Synonyms:CHEMBL2074720
TypeSmall organic molecule
Emp. Form.C39H44N4O12
Mol. Mass.760.7863
SMILESCC1=C(C=C)\C(NC1=O)=C\c1[nH]c(Cc2[nH]c(\C=C3/NC(=O)C(C=C)=C3C)c(C)c2CCC(O)=O)c(CCC(=O)O[C@@H]2OC([C@@H](O)C(O)C2O)C(O)=O)c1C