Reaction Details
TargetATP-binding cassette sub-family C member 2
LigandBDBM50420221
Substrate/Competitorn/a
Meas. Tech.ChEMBL_836946 (CHEMBL2075786)
IC50 200±n/a nM
Citation Jedlitschky, GLeier, IBöhme, MBuchholz, UBar-Tana, JKeppler, D Hepatobiliary elimination of the peroxisome proliferator nafenopin by conjugation and subsequent ATP-dependent transport across the canalicular membrane. Biochem Pharmacol48:1113-20 (1994) ATP-binding cassette sub-family C member 2
Name:ATP-binding cassette sub-family C member 2
Type:PROTEIN
Mol. Mass.:173415.22
Organism:Rattus norvegicus
Description:ChEMBL_1455464
Residue:1541
BDBM50420221
NameBDBM50420221
Synonyms:CHEMBL325447
TypeSmall organic molecule
Emp. Form.C30H47N3O9S
Mol. Mass.625.774
SMILESCCCCC\C=C/C\C=C/C=C/C=C/[C@H](SC[C@H](NC(=O)CCC(N)C(O)=O)C(=O)NCC(O)=O)C(O)CCCC(O)=O