Reaction Details
TargetATP-binding cassette sub-family C member 5
LigandBDBM14390
Substrate/Competitorn/a
Meas. Tech.ChEMBL_836094 (CHEMBL2077530)
IC50 80000±n/a nM
Citation Reid, GWielinga, PZelcer, NDe Haas, MVan Deemter, LWijnholds, JBalzarini, JBorst, P Characterization of the transport of nucleoside analog drugs by the human multidrug resistance proteins MRP4 and MRP5. Mol Pharmacol63:1094-103 (2003) ATP-binding cassette sub-family C member 5
Name:ATP-binding cassette sub-family C member 5
Type:PROTEIN
Mol. Mass.:160694.29
Organism:Homo sapiens (Human)
Description:ChEMBL_836094
Residue:1437
BDBM14390
NameBDBM14390
Synonyms:5-[2-ethoxy-5-(4-methyl-1-piperazinylsulfonyl)phenyl]-1-methyl-3-n-propyl-1,6-dihydro-7H-pyrazolo[4,3-d]pyrimidin-7-one CHEMBL192 Sildenafil US11155558, Compound sildenafil Viagra
TypeSmall organic molecule
Emp. Form.C22H30N6O4S
Mol. Mass.474.576
SMILESCCCc1nn(C)c2c1nc([nH]c2=O)-c1cc(ccc1OCC)S(=O)(=O)N1CCN(C)CC1