Reaction Details
TargetSolute carrier family 22 member 1
LigandBDBM50416487
Substrate/Competitorn/a
Meas. Tech.ChEMBL_839183 (CHEMBL2077854)
Ki 7300±n/a nM
Citation Dresser, MJGray, ATGiacomini, KM Kinetic and selectivity differences between rodent, rabbit, and human organic cation transporters (OCT1). J Pharmacol Exp Ther292:1146-52 (2000) Solute carrier family 22 member 1
Name:Solute carrier family 22 member 1
Type:PROTEIN
Mol. Mass.:61521.43
Organism:Mus musculus
Description:ChEMBL_1279071
Residue:556
BDBM50416487
NameBDBM50416487
Synonyms:CHEMBL1236196 | TETRABUTYLAMMONIUM
TypeSmall organic molecule
Emp. Form.C16H36N
Mol. Mass.242.4632
SMILESCCCC[N+](CCCC)(CCCC)CCCC