Reaction Details
TargetSolute carrier family 22 member 1
LigandBDBM50079455
Substrate/Competitorn/a
Meas. Tech.ChEMBL_836136 (CHEMBL2077572)
Ki 905000±n/a nM
Citation Dresser, MJGray, ATGiacomini, KM Kinetic and selectivity differences between rodent, rabbit, and human organic cation transporters (OCT1). J Pharmacol Exp Ther292:1146-52 (2000) Solute carrier family 22 member 1
Name:Solute carrier family 22 member 1
Type:Enzyme Catalytic Domain
Mol. Mass.:61538.40
Organism:RAT
Description:Adrenaline alpha1 0 RAT::Q63089
Residue:556
BDBM50079455
NameBDBM50079455
Synonyms:CHEMBL46486 | tetramethylammonium
TypeSmall organic molecule
Emp. Form.C4H12N
Mol. Mass.74.1442
SMILESC[N+](C)(C)C