Reaction Details
TargetSolute carrier family 22 member 1
LigandBDBM50420179
Substrate/Competitorn/a
Meas. Tech.ChEMBL_839183 (CHEMBL2077854)
Ki 19800±n/a nM
Citation Dresser, MJGray, ATGiacomini, KM Kinetic and selectivity differences between rodent, rabbit, and human organic cation transporters (OCT1). J Pharmacol Exp Ther292:1146-52 (2000) Solute carrier family 22 member 1
Name:Solute carrier family 22 member 1
Type:PROTEIN
Mol. Mass.:61521.43
Organism:Mus musculus
Description:ChEMBL_1279071
Residue:556
BDBM50420179
NameBDBM50420179
Synonyms:CHEMBL2074857
TypeSmall organic molecule
Emp. Form.C12H28N
Mol. Mass.186.3569
SMILESCCC[N+](CCC)(CCC)CCC