Reaction Details
TargetSolute carrier family 22 member 2
LigandBDBM50367247
Substrate/Competitorn/a
Meas. Tech.ChEMBL_835924 (CHEMBL2077062)
IC50 2800±n/a nM
Citation Kakehi, MKoyabu, NNakamura, TUchiumi, TKuwano, MOhtani, HSawada, Y Functional characterization of mouse cation transporter mOCT2 compared with mOCT1. Biochem Biophys Res Commun296:644-50 (2002) Solute carrier family 22 member 2
Name:Solute carrier family 22 member 2
Type:PROTEIN
Mol. Mass.:61838.23
Organism:Mus musculus
Description:ChEMBL_835924
Residue:553
BDBM50367247
NameBDBM50367247
Synonyms:QUININE Quinsan | cid_3034034
TypeSmall organic molecule
Emp. Form.C20H24N2O2
Mol. Mass.324.4168
SMILESCOc1ccc2nccc([C@@H](O)[C@@H]3C[C@@H]4CCN3C[C@@H]4C=C)c2c1