Reaction Details
TargetSolute carrier organic anion transporter family member 2A1
LigandBDBM21544
Substrate/Competitorn/a
Meas. Tech.ChEMBL_837082 (CHEMBL2076334)
Ki 45±n/a nM
Citation Pucci, MLBao, YChan, BItoh, SLu, RCopeland, NGGilbert, DJJenkins, NASchuster, VL Cloning of mouse prostaglandin transporter PGT cDNA: species-specific substrate affinities. Am J Physiol277:734-41 (1999) 
 
Solute carrier organic anion transporter family member 2A1
Name:Solute carrier organic anion transporter family member 2A1
Type:Protein
Mol. Mass.:70404.97
Organism:Rattus norvegicus (Rat)
Description:Q00910
Residue:644
BDBM21544
NameBDBM21544
Synonyms:(5Z)-7-[(1R,2R,5S)-5-hydroxy-2-[(1E,3S)-3-hydroxyoct-1-en-1-yl]-3-oxocyclopentyl]hept-5-enoic acid Prostaglandin D2 | [3H]PGD2
Typeradiolabeled ligand
Emp. Form.C20H32O5
Mol. Mass.352.4651
SMILESCCCCC[C@H](O)\C=C\[C@@H]1[C@@H](C\C=C/CCCC(O)=O)[C@@H](O)CC1=O