Reaction Details
TargetATP-binding cassette sub-family C member 2
LigandBDBM18050
Substrate/Competitorn/a
Meas. Tech.ChEMBL_836174 (CHEMBL2075073)
Ki 236000±n/a nM
Citation Masuda, MI'izuka, YYamazaki, MNishigaki, RKato, YNi'inuma, KSuzuki, HSugiyama, Y Methotrexate is excreted into the bile by canalicular multispecific organic anion transporter in rats. Cancer Res57:3506-10 (1997) ATP-binding cassette sub-family C member 2
Name:ATP-binding cassette sub-family C member 2
Type:PROTEIN
Mol. Mass.:173415.22
Organism:Rattus norvegicus
Description:ChEMBL_1455464
Residue:1541
BDBM18050
NameBDBM18050
Synonyms:2-[(4-{[(2,4-diaminopteridin-6-yl)methyl](methyl)amino}phenyl)formamido]pentanedioic acid MTX cid_126941
TypeSmall organic molecule
Emp. Form.C20H22N8O5
Mol. Mass.454.4393
SMILESCN(Cc1cnc2nc(N)nc(N)c2n1)c1ccc(cc1)C(=O)N[C@@H](CCC(O)=O)C(O)=O