Reaction Details
TargetSolute carrier family 22 member 2
LigandBDBM39687
Substrate/Competitorn/a
Meas. Tech.ChEMBL_836109 (CHEMBL2077545)
IC50 13800±n/a nM
Citation Okuda, MUrakami, YSaito, HInui, K Molecular mechanisms of organic cation transport in OCT2-expressing Xenopus oocytes. Biochim Biophys Acta1417:224-31 (1999) Solute carrier family 22 member 2
Name:Solute carrier family 22 member 2
Type:Enzyme Catalytic Domain
Mol. Mass.:62348.38
Organism:RAT
Description:Adrenaline alpha2 0 RAT::Q9R0W2
Residue:555
BDBM39687
NameBDBM39687
Synonyms:(2E)-1-ethyl-2-[(1-ethyl-2-quinolin-1-iumyl)methylidene]quinoline;chloride (2E)-1-ethyl-2-[(1-ethylquinolin-1-ium-2-yl)methylidene]quinoline;chloride CHEMBL1197556 SMR000137574 | cid_5717105
TypeSmall organic molecule
Emp. Form.C23H23N2
Mol. Mass.327.4416
SMILESCCN1\C(=C\c2ccc3ccccc3[n+]2CC)C=Cc2ccccc12