Reaction Details
TargetSolute carrier family 22 member 6
LigandBDBM50390999
Substrate/Competitorn/a
Meas. Tech.ChEMBL_838516 (CHEMBL2078144)
Ki 210±n/a nM
Citation Takeda, MBabu, ENarikawa, SEndou, H Interaction of human organic anion transporters with various cephalosporin antibiotics. Eur J Pharmacol438:137-42 (2002) Solute carrier family 22 member 6
Name:Solute carrier family 22 member 6
Type:PROTEIN
Mol. Mass.:61831.78
Organism:Homo sapiens (Human)
Description:ChEMBL_1487359
Residue:563
BDBM50390999
NameBDBM50390999
Synonyms:CEFOPERAZONE
TypeSmall organic molecule
Emp. Form.C25H27N9O8S2
Mol. Mass.645.667
SMILESCCN1CCN(C(=O)N[C@@H](C(=O)N[C@H]2[C@H]3SCC(CSc4nnnn4C)=C(N3C2=O)C(O)=O)c2ccc(O)cc2)C(=O)C1=O