Reaction Details
TargetSolute carrier family 22 member 11
LigandBDBM82898
Substrate/Competitorn/a
Meas. Tech.ChEMBL_838708 (CHEMBL2078490)
Ki 200±n/a nM
Citation Takeda, MBabu, ENarikawa, SEndou, H Interaction of human organic anion transporters with various cephalosporin antibiotics. Eur J Pharmacol438:137-42 (2002) Solute carrier family 22 member 11
Name:Solute carrier family 22 member 11
Type:PROTEIN
Mol. Mass.:59982.54
Organism:Homo sapiens (Human)
Description:ChEMBL_838708
Residue:550
BDBM82898
NameBDBM82898
Synonyms:(6R,7R)-3-(acetoxymethyl)-8-keto-7-[[2-(2-thienyl)acetyl]amino]-5-thia-1-azabicyclo[4.2.0]oct-2-ene-2-carboxylic acid (6R,7R)-3-(acetyloxymethyl)-8-oxo-7-[(1-oxo-2-thiophen-2-ylethyl)amino]-5-thia-1-azabicyclo[4.2.0]oct-2-ene-2-carboxylic acid Cephalothin SMR000386987 | cid_6024
TypeSmall organic molecule
Emp. Form.C16H16N2O6S2
Mol. Mass.396.438
SMILESCC(=O)OCC1=C(N2[C@H](SC1)[C@H](NC(=O)Cc1cccs1)C2=O)C(O)=O