Reaction Details
TargetSolute carrier family 22 member 11
LigandBDBM50049707
Substrate/Competitorn/a
Meas. Tech.ChEMBL_838708 (CHEMBL2078490)
Ki 2380±n/a nM
Citation Takeda, MBabu, ENarikawa, SEndou, H Interaction of human organic anion transporters with various cephalosporin antibiotics. Eur J Pharmacol438:137-42 (2002) Solute carrier family 22 member 11
Name:Solute carrier family 22 member 11
Type:PROTEIN
Mol. Mass.:59982.54
Organism:Homo sapiens (Human)
Description:ChEMBL_838708
Residue:550
BDBM50049707
NameBDBM50049707
Synonyms:(6R,7R)-7-{2-(2-Amino-thiazol-4-yl)-2-[(Z)-methoxyimino]-acetylamino}-3-(2-methyl-5,6-dioxo-1,2,5,6-tetrahydro-[1,2,4]triazin-3-ylsulfanylmethyl)-8-oxo-5-thia-1-aza-bicyclo[4.2.0]oct-2-ene-2-carboxylic acid (6R,7R,)-7-(2-(2-aminothiazol-4-yl)-2-(methoxyimino)acetamido)-3-((2-methyl-5,6-dioxo-1,2,5,6-tetrahydro-1,2,4-triazin-3-ylthio)methyl)-8-oxo-5-thia-1-aza-bicyclo[4.2.0]oct-2-ene-2-carboxylic acid 7-[2-(2-Amino-thiazol-4-yl)-2-methoxyimino-acetylamino]-3-(6-hydroxy-2-methyl-5-oxo-2,5-dihydro-[1,2,4]triazin-3-ylsulfanylmethyl)-8-oxo-5-thia-1-aza-bicyclo[4.2.0]oct-2-ene-2-carboxylic acid (Ceftriaxone) CHEMBL161 | ceftriaxone
TypeSmall organic molecule
Emp. Form.C18H18N8O7S3
Mol. Mass.554.58
SMILESCO\N=C(/C(=O)N[C@H]1[C@H]2SCC(CSc3nc(=O)c(=O)[nH]n3C)=C(N2C1=O)C(O)=O)c1csc(N)n1