Reaction Details
TargetSolute carrier family 22 member 6
LigandBDBM50350473
Substrate/Competitorn/a
Meas. Tech.ChEMBL_838516 (CHEMBL2078144)
Ki 740±n/a nM
Citation Takeda, MBabu, ENarikawa, SEndou, H Interaction of human organic anion transporters with various cephalosporin antibiotics. Eur J Pharmacol438:137-42 (2002) Solute carrier family 22 member 6
Name:Solute carrier family 22 member 6
Type:PROTEIN
Mol. Mass.:61831.78
Organism:Homo sapiens (Human)
Description:ChEMBL_1487359
Residue:563
BDBM50350473
NameBDBM50350473
Synonyms:Aliporina | CEFALORIDINE
TypeSmall organic molecule
Emp. Form.C19H17N3O4S2
Mol. Mass.415.486
SMILES[O-]C(=O)C1=C(C[n+]2ccccc2)CS[C@@H]2[C@@H](NC(=O)Cc3cccs3)C(=O)N12