Reaction Details
TargetSolute carrier family 22 member 8
LigandBDBM17638
Substrate/Competitorn/a
Meas. Tech.ChEMBL_838511 (CHEMBL2078139)
Ki 5950±n/a nM
Citation Takeda, MKhamdang, SNarikawa, SKimura, HHosoyamada, MCha, SHSekine, TEndou, H Characterization of methotrexate transport and its drug interactions with human organic anion transporters. J Pharmacol Exp Ther302:666-71 (2002) 
 
Solute carrier family 22 member 8
Name:Solute carrier family 22 member 8
Type:PROTEIN
Mol. Mass.:59870.13
Organism:Homo sapiens (Human)
Description:ChEMBL_1486920
Residue:542
BDBM17638
NameBDBM17638
Synonyms:2-{1-[(4-chlorophenyl)carbonyl]-5-methoxy-2-methyl-1H-indol-3-yl}acetic acid Indocin US11478464, Compound Indomethacin US9271961, Indomethacin | indometacin
TypeSmall organic molecule
Emp. Form.C19H16ClNO4
Mol. Mass.357.788
SMILESCOc1ccc2n(C(=O)c3ccc(Cl)cc3)c(C)c(CC(O)=O)c2c1