Reaction Details
TargetSolute carrier family 22 member 8
LigandBDBM50022787
Substrate/Competitorn/a
Meas. Tech.ChEMBL_838511 (CHEMBL2078139)
Ki 97600±n/a nM
Citation Takeda, MKhamdang, SNarikawa, SKimura, HHosoyamada, MCha, SHSekine, TEndou, H Characterization of methotrexate transport and its drug interactions with human organic anion transporters. J Pharmacol Exp Ther302:666-71 (2002) 
 
Solute carrier family 22 member 8
Name:Solute carrier family 22 member 8
Type:PROTEIN
Mol. Mass.:59870.13
Organism:Homo sapiens (Human)
Description:ChEMBL_1486920
Residue:542
BDBM50022787
NameBDBM50022787
Synonyms:(+)-3,3-Dimethyl-7-oxo-6-phenylacetylamino-4-thia-1-aza-bicyclo[3.2.0]heptane-2-carboxylic acid(penicillin G) (2S,5R,6R)-3,3-dimethyl-7-oxo-6-(2-phenylacetamido)-4-thia-1-aza-bicyclo[3.2.0]heptane-2-carboxylic acid 3,3-Dimethyl-7-oxo-6-phenylacetylamino-4-thia-1-aza-bicyclo[3.2.0]heptane-2-carboxylic acid anion (Penicillin G) BICILLIN PENICILLIN G PROCAINE PERMAPEN PFIZERPEN-AS | benzylpenicillin
TypeSmall organic molecule
Emp. Form.C16H18N2O4S
Mol. Mass.334.39
SMILESCC1(C)S[C@@H]2[C@H](NC(=O)Cc3ccccc3)C(=O)N2[C@H]1C(O)=O