Reaction Details
TargetSolute carrier family 22 member 6
LigandBDBM50420191
Substrate/Competitorn/a
Meas. Tech.ChEMBL_838479 (CHEMBL2076050)
Ki 488000±n/a nM
Citation Apiwattanakul, NSekine, TChairoungdua, AKanai, YNakajima, NSophasan, SEndou, H Transport properties of nonsteroidal anti-inflammatory drugs by organic anion transporter 1 expressed in Xenopus laevis oocytes. Mol Pharmacol55:847-54 (1999) Solute carrier family 22 member 6
Name:Solute carrier family 22 member 6
Type:PROTEIN
Mol. Mass.:60784.17
Organism:Rattus norvegicus
Description:ChEMBL_838479
Residue:551
BDBM50420191
NameBDBM50420191
Synonyms:ACETPHENETIDIN PHENACETIN
TypeSmall organic molecule
Emp. Form.C10H13NO2
Mol. Mass.179.2157
SMILESCCOc1ccc(NC(C)=O)cc1