Reaction Details
TargetSolute carrier organic anion transporter family member 1A1
LigandBDBM50420246
Substrate/Competitorn/a
Meas. Tech.ChEMBL_838286 (CHEMBL2076234)
Ki 9700±n/a nM
Citation Kanai, NLu, RBao, YWolkoff, AWVore, MSchuster, VL Estradiol 17 beta-D-glucuronide is a high-affinity substrate for oatp organic anion transporter. Am J Physiol270:326-31 (1996) 
 
Solute carrier organic anion transporter family member 1A1
Name:Solute carrier organic anion transporter family member 1A1
Type:PROTEIN
Mol. Mass.:74188.94
Organism:Rattus norvegicus
Description:ChEMBL_838286
Residue:670
BDBM50420246
NameBDBM50420246
Synonyms:CHEMBL2074591
TypeSmall organic molecule
Emp. Form.C24H32O8
Mol. Mass.448.5061
SMILESC[C@]12CC[C@H]3[C@@H](CCc4cc(O[C@@H]5O[C@@H]([C@@H](O)[C@H](O)[C@H]5O)C(O)=O)ccc34)[C@@H]1CC[C@@H]2O