Reaction Details
TargetSolute carrier organic anion transporter family member 2A1
LigandBDBM50420250
Substrate/Competitorn/a
Meas. Tech.ChEMBL_836139 (CHEMBL2077575)
Ki 35000±n/a nM
Citation Kanai, NLu, RSatriano, JABao, YWolkoff, AWSchuster, VL Identification and characterization of a prostaglandin transporter. Science268:866-869 (1995) Solute carrier organic anion transporter family member 2A1
Name:Solute carrier organic anion transporter family member 2A1
Type:Protein
Mol. Mass.:70404.97
Organism:Rattus norvegicus (Rat)
Description:Q00910
Residue:644
BDBM50420250
NameBDBM50420250
Synonyms:INDOCYANINE GREEN
TypeSmall organic molecule
Emp. Form.C43H48N2O6S2
Mol. Mass.752.981
SMILESCC1(C)\C(=C\C=C\C=C\C=C\C2=[N+](CCCCS([O-])(=O)=O)c3ccc4ccccc4c3C2(C)C)N(CCCCS(O)(=O)=O)c2ccc3ccccc3c12