Reaction Details
TargetATP-binding cassette sub-family C member 4
LigandBDBM50344959
Substrate/Competitorn/a
Meas. Tech.ChEMBL_835929 (CHEMBL2077067)
IC50 30000±n/a nM
Citation Zelcer, NReid, GWielinga, PKuil, Avan der Heijden, ISchuetz, JDBorst, P Steroid and bile acid conjugates are substrates of human multidrug-resistance protein (MRP) 4 (ATP-binding cassette C4). Biochem J371:361-7 (2003) 
 
ATP-binding cassette sub-family C member 4
Name:ATP-binding cassette sub-family C member 4
Type:PROTEIN
Mol. Mass.:149546.12
Organism:Homo sapiens (Human)
Description:ChEMBL_1486828
Residue:1325
BDBM50344959
NameBDBM50344959
Synonyms:17beta-Estradiol-17-(beta-D-glucuronide) E17β-glucuronide | estradiol 17b glucuronide
TypeSmall organic molecule
Emp. Form.C24H32O8
Mol. Mass.448.5061
SMILESC[C@]12CC[C@H]3[C@@H](CCc4cc(O)ccc34)[C@@H]1CC[C@@H]2O[C@@H]1O[C@@H]([C@@H](O)[C@H](O)[C@H]1O)C(O)=O