Reaction Details
TargetATP-binding cassette sub-family C member 4
LigandBDBM50420246
Substrate/Competitorn/a
Meas. Tech.ChEMBL_836095 (CHEMBL2077531)
IC50 120000±n/a nM
Citation Zelcer, NReid, GWielinga, PKuil, Avan der Heijden, ISchuetz, JDBorst, P Steroid and bile acid conjugates are substrates of human multidrug-resistance protein (MRP) 4 (ATP-binding cassette C4). Biochem J371:361-7 (2003) 
 
ATP-binding cassette sub-family C member 4
Name:ATP-binding cassette sub-family C member 4
Type:PROTEIN
Mol. Mass.:149546.12
Organism:Homo sapiens (Human)
Description:ChEMBL_1486828
Residue:1325
BDBM50420246
NameBDBM50420246
Synonyms:CHEMBL2074591
TypeSmall organic molecule
Emp. Form.C24H32O8
Mol. Mass.448.5061
SMILESC[C@]12CC[C@H]3[C@@H](CCc4cc(O[C@@H]5O[C@@H]([C@@H](O)[C@H](O)[C@H]5O)C(O)=O)ccc34)[C@@H]1CC[C@@H]2O