Reaction Details
TargetATP-binding cassette sub-family C member 4
LigandBDBM50420254
Substrate/Competitorn/a
Meas. Tech.ChEMBL_836095 (CHEMBL2077531)
IC50 80000±n/a nM
Citation Zelcer, NReid, GWielinga, PKuil, Avan der Heijden, ISchuetz, JDBorst, P Steroid and bile acid conjugates are substrates of human multidrug-resistance protein (MRP) 4 (ATP-binding cassette C4). Biochem J371:361-7 (2003) 
 
ATP-binding cassette sub-family C member 4
Name:ATP-binding cassette sub-family C member 4
Type:PROTEIN
Mol. Mass.:149546.12
Organism:Homo sapiens (Human)
Description:ChEMBL_1486828
Residue:1325
BDBM50420254
NameBDBM50420254
Synonyms:CHEMBL2074982
TypeSmall organic molecule
Emp. Form.C25H36O8
Mol. Mass.464.5485
SMILESC[C@]12CC[C@H]3[C@@H](CC=C4C[C@H](CC[C@]34C)O[C@@H]3O[C@@H]([C@@H](O)[C@H](O)[C@H]3O)C(O)=O)[C@@H]1CCC2=O