Reaction Details
TargetATP-binding cassette sub-family C member 4
LigandBDBM50366524
Substrate/Competitorn/a
Meas. Tech.ChEMBL_835929 (CHEMBL2077067)
IC50 95000±n/a nM
Citation Zelcer, NReid, GWielinga, PKuil, Avan der Heijden, ISchuetz, JDBorst, P Steroid and bile acid conjugates are substrates of human multidrug-resistance protein (MRP) 4 (ATP-binding cassette C4). Biochem J371:361-7 (2003) 
 
ATP-binding cassette sub-family C member 4
Name:ATP-binding cassette sub-family C member 4
Type:PROTEIN
Mol. Mass.:149546.12
Organism:Homo sapiens (Human)
Description:ChEMBL_1486828
Residue:1325
BDBM50366524
NameBDBM50366524
Synonyms:ESTRONE Estrone 3-sulfate | Estrone Sulphate
TypeSmall organic molecule
Emp. Form.C18H22O5S
Mol. Mass.350.429
SMILESC[C@]12CC[C@H]3[C@@H](CCc4cc(OS(O)(=O)=O)ccc34)[C@@H]1CCC2=O