Reaction Details
TargetSolute carrier family 22 member 2
LigandBDBM50367247
Substrate/Competitorn/a
Meas. Tech.ChEMBL_838771 (CHEMBL2078597)
Ki 55000±n/a nM
Citation Arndt, PVolk, CGorboulev, VBudiman, TPopp, CUlzheimer-Teuber, IAkhoundova, AKoppatz, SBamberg, ENagel, GKoepsell, H Interaction of cations, anions, and weak base quinine with rat renal cation transporter rOCT2 compared with rOCT1. Am J Physiol Renal Physiol281:454-68 (2001) 
 
Solute carrier family 22 member 2
Name:Solute carrier family 22 member 2
Type:Enzyme Catalytic Domain
Mol. Mass.:62348.38
Organism:RAT
Description:Adrenaline alpha2 0 RAT::Q9R0W2
Residue:555
BDBM50367247
NameBDBM50367247
Synonyms:QUININE Quinsan | cid_3034034
TypeSmall organic molecule
Emp. Form.C20H24N2O2
Mol. Mass.324.4168
SMILESCOc1ccc2nccc([C@@H](O)[C@@H]3C[C@@H]4CCN3C[C@@H]4C=C)c2c1