Reaction Details
TargetSolute carrier family 15 member 2
LigandBDBM50350470
Substrate/Competitorn/a
Meas. Tech.ChEMBL_838253 (CHEMBL2076201)
Ki 11400000±n/a nM
Citation Luckner, PBrandsch, M Interaction of 31 beta-lactam antibiotics with the H+/peptide symporter PEPT2: analysis of affinity constants and comparison with PEPT1. Eur J Pharm Biopharm59:17-24 (2004) 
 
Solute carrier family 15 member 2
Name:Solute carrier family 15 member 2
Type:PROTEIN
Mol. Mass.:81331.63
Organism:Rattus norvegicus
Description:ChEMBL_838253
Residue:729
BDBM50350470
NameBDBM50350470
Synonyms:CEFEPIME | Maxipime
TypeSmall organic molecule
Emp. Form.C19H24N6O5S2
Mol. Mass.480.561
SMILESCO\N=C(/C(=O)N[C@H]1[C@H]2SCC(C[N+]3(C)CCCC3)=C(N2C1=O)C([O-])=O)c1csc(N)n1