Reaction Details
TargetSolute carrier family 15 member 1
LigandBDBM50370585
Substrate/Competitorn/a
Meas. Tech.ChEMBL_838254 (CHEMBL2076202)
Ki 9800±n/a nM
Citation Luckner, PBrandsch, M Interaction of 31 beta-lactam antibiotics with the H+/peptide symporter PEPT2: analysis of affinity constants and comparison with PEPT1. Eur J Pharm Biopharm59:17-24 (2004) 
 
Solute carrier family 15 member 1
Name:Solute carrier family 15 member 1
Type:PROTEIN
Mol. Mass.:78818.07
Organism:Homo sapiens (Human)
Description:ChEMBL_1488839
Residue:708
BDBM50370585
NameBDBM50370585
Synonyms:Anspor Cefradine
TypeSmall organic molecule
Emp. Form.C16H19N3O4S
Mol. Mass.349.405
SMILESCC1=C(N2[C@H](SC1)[C@H](NC(=O)[C@H](N)C1=CCC=CC1)C2=O)C(O)=O