Reaction Details
TargetCasein kinase I isoform alpha
LigandBDBM92674
Substrate/Competitorn/a
Meas. Tech.ChEMBL_842102 (CHEMBL2091519)
IC50 10000±n/a nM
Citation Yang, LLLi, GBYan, HXSun, QZMa, SJi, PWang, ZRFeng, SZou, JYang, SY Discovery of N6-phenyl-1H-pyrazolo[3,4-d]pyrimidine-3,6-diamine derivatives as novel CK1 inhibitors using common-feature pharmacophore model based virtual screening and hit-to-lead optimization. Eur J Med Chem56:30-38 (2012) 
 
Casein kinase I isoform alpha
Name:Casein kinase I isoform alpha
Type:Serine/threonine-protein kinase
Mol. Mass.:38936.59
Organism:Homo sapiens (Human)
Description:P48729
Residue:337
BDBM92674
NameBDBM92674
Synonyms:Isoquinolinesulfonamide, CKI-7
TypeSmall molecule
Emp. Form.C11H12ClN3O2S
Mol. Mass.285.75
SMILESNCCNS(=O)(=O)c1ccc(Cl)c2ccncc12