Reaction Details
TargetCasein kinase I isoform alpha
LigandBDBM50263829
Substrate/Competitorn/a
Meas. Tech.ChEMBL_842102 (CHEMBL2091519)
IC50 1000±n/a nM
Citation Yang, LLLi, GBYan, HXSun, QZMa, SJi, PWang, ZRFeng, SZou, JYang, SY Discovery of N6-phenyl-1H-pyrazolo[3,4-d]pyrimidine-3,6-diamine derivatives as novel CK1 inhibitors using common-feature pharmacophore model based virtual screening and hit-to-lead optimization. Eur J Med Chem56:30-38 (2012) 
 
Casein kinase I isoform alpha
Name:Casein kinase I isoform alpha
Type:Serine/threonine-protein kinase
Mol. Mass.:38936.59
Organism:Homo sapiens (Human)
Description:P48729
Residue:337
BDBM50263829
NameBDBM50263829
Synonyms:3-(2,4,6-Trimethoxybenzylidene)indolin-2-one 3-[(2,4,6-trimethoxyphenyl)methylidenyl]-indolin-2-one | CHEMBL489156
TypeSmall organic molecule
Emp. Form.C18H17NO4
Mol. Mass.311.3319
SMILESCOc1cc(OC)c(\C=C2\C(=O)Nc3ccccc23)c(OC)c1