Reaction Details
TargetCasein kinase I isoform alpha
LigandBDBM50229971
Substrate/Competitorn/a
Meas. Tech.ChEMBL_842102 (CHEMBL2091519)
IC50 300±n/a nM
Citation Yang, LLLi, GBYan, HXSun, QZMa, SJi, PWang, ZRFeng, SZou, JYang, SY Discovery of N6-phenyl-1H-pyrazolo[3,4-d]pyrimidine-3,6-diamine derivatives as novel CK1 inhibitors using common-feature pharmacophore model based virtual screening and hit-to-lead optimization. Eur J Med Chem56:30-38 (2012) 
 
Casein kinase I isoform alpha
Name:Casein kinase I isoform alpha
Type:Serine/threonine-protein kinase
Mol. Mass.:38936.59
Organism:Homo sapiens (Human)
Description:P48729
Residue:337
BDBM50229971
NameBDBM50229971
Synonyms:4-(4-(2,3-Dihydrobenzo[1,4]dioxin-6-yl)-5-pyridin-2-yl-1H-imidazol-2-yl)benzamide 4-[4-(2,3-dihydro-benzo[1,4]dioxin-6-yl)-5-pyridin-2-yl-1H-imidazol-2-yl]benzamide | CHEMBL410456
TypeSmall organic molecule
Emp. Form.C23H18N4O3
Mol. Mass.398.414
SMILESNC(=O)c1ccc(cc1)-c1nc(c([nH]1)-c1ccc2OCCOc2c1)-c1ccccn1