Reaction Details
TargetCasein kinase I isoform alpha
LigandBDBM50420298
Substrate/Competitorn/a
Meas. Tech.ChEMBL_839751 (CHEMBL2089673)
IC50 600±n/a nM
Citation Bettayeb, KGresh, NMeijer, LOumata, N Synthesis and biological evaluation of selective and potent cyclin-dependent kinase inhibitors. Eur J Med Chem56:210-216 (2012) 
 
Casein kinase I isoform alpha
Name:Casein kinase I isoform alpha
Type:Serine/threonine-protein kinase
Mol. Mass.:38936.59
Organism:Homo sapiens (Human)
Description:P48729
Residue:337
BDBM50420298
NameBDBM50420298
Synonyms:CHEMBL2089033
TypeSmall organic molecule
Emp. Form.C26H31N7O2
Mol. Mass.473.57
SMILESCC(C)n1cnc2c(NCc3ccc(cc3)-c3ccccn3)nc(N[C@@H]3CCC[C@H](O)[C@@H]3O)nc12