Reaction Details
TargetCyclin-dependent kinase 6/G1/S-specific cyclin-D3
LigandBDBM50420307
Substrate/Competitorn/a
Meas. Tech.ChEMBL_839771 (CHEMBL2089693)
IC50 1100±n/a nM
Citation Cho, YSAngove, HBrain, CChen, CHCheng, HCheng, RChopra, RChung, KCongreve, MDagostin, CDavis, DJFeltell, RGiraldes, JHiscock, SDKim, SKovats, SLagu, BLewry, KLoo, ALu, YLuzzio, MManiara, WMcMenamin, RMortenson, PNBenning, RRees, DCShen, JSmith, TWang, YWilliams, GWoolford, AJWrona, WXu, MYang, FHoward, S Fragment-Based Discovery of 7-Azabenzimidazoles as Potent, Highly Selective, and Orally Active CDK4/6 Inhibitors. ACS Med Chem Lett3:445-449 (2012) 
 
Cyclin-dependent kinase 6/G1/S-specific cyclin-D3
Name:Cyclin-dependent kinase 6/G1/S-specific cyclin-D3
Type:Protein
Mol. Mass.:n/a
Description:n/a
Components:This complex has 2 components.
Component 1
Name:Cyclin-dependent kinase 6
Synonyms:CDK6 CDKN6 Cyclin-dependent kinase 6 (CDK 6) | Serine/threonine-protein kinase PLSTIRE
Type:Enzyme Subunit
Mol. Mass.:36937.42
Organism:Homo sapiens (Human)
Description:Q00534
Residue:326
Component 2
Name:G1/S-specific cyclin-D3
Synonyms:CCND3 | CCND3_HUMAN
Type:Enzyme
Mol. Mass.:32521.90
Organism:Homo sapiens (Human)
Description:P30281
Residue:292
BDBM50420307
NameBDBM50420307
Synonyms:CHEMBL2089062
TypeSmall organic molecule
Emp. Form.C25H26N6O
Mol. Mass.426.5135
SMILESCN(C)C1CCN(CC1)c1ccc2nc([nH]c2c1)C(=O)c1ccnc(c1)-c1cccnc1