Reaction Details
TargetPhosphatidylinositol 4,5-bisphosphate 3-kinase catalytic subunit beta isoform
LigandBDBM50420313
Substrate/Competitorn/a
Meas. Tech.ChEMBL_839972 (CHEMBL2090368)
IC50 0.5±n/a nM
Citation Lin, HSchulz, MJXie, RZeng, JLuengo, JISquire, MDTedesco, RQu, JErhard, KMack, JFRaha, KPlant, RRominger, CMAriazi, JLSherk, CSSchaber, MDMcSurdy-Freed, JSpengler, MDDavis, CBHardwicke, MARivero, RA Rational Design, Synthesis, and SAR of a Novel Thiazolopyrimidinone Series of Selective PI3K-beta Inhibitors. ACS Med Chem Lett3:524-529 (2012) 
 
Phosphatidylinositol 4,5-bisphosphate 3-kinase catalytic subunit beta isoform
Name:Phosphatidylinositol 4,5-bisphosphate 3-kinase catalytic subunit beta isoform
Type:Enzyme Subunit
Mol. Mass.:122769.00
Organism:Homo sapiens (Human)
Description:P42338
Residue:1070
BDBM50420313
NameBDBM50420313
Synonyms:CHEMBL2089108
TypeSmall organic molecule
Emp. Form.C20H21F3N4O2S
Mol. Mass.438.467
SMILESCCc1nc(=O)c2sc(nc2n1Cc1cccc(c1C)C(F)(F)F)N1CCOCC1