Reaction Details
TargetSerine protease hepsin
LigandBDBM50420334
Substrate/Competitorn/a
Meas. Tech.ChEMBL_840133 (CHEMBL2090836)
Ki 1.1±n/a nM
Citation Colombo, EDésilets, ADuchêne, DChagnon, FNajmanovich, RLeduc, RMarsault, E Design and synthesis of potent, selective inhibitors of matriptase. ACS Med Chem Lett3:530-534 (2012) 
 
Serine protease hepsin
Name:Serine protease hepsin
Type:Enzyme
Mol. Mass.:45016.98
Organism:Homo sapiens (Human)
Description:Human deglycosylated hepsin was expressed in Pichia pastoris.
Residue:417
BDBM50420334
NameBDBM50420334
Synonyms:CHEMBL2086421
TypeSmall organic molecule
Emp. Form.C27H42N12O5S
Mol. Mass.646.765
SMILES[#6]-[#6@H](-[#7]-[#6](=O)-[#6@H](-[#6]-[#6]-[#6](-[#7])=O)-[#7]-[#6](=O)-[#6@@H](-[#7])-[#6]-[#6]-[#6]\[#7]=[#6](\[#7])-[#7])-[#6](=O)-[#7]-[#6@@H](-[#6]-[#6]-[#6]\[#7]=[#6](\[#7])-[#7])-[#6](=O)-c1nc2ccccc2s1