Reaction Details
TargetSnake venom metalloproteinase BaP1
LigandBDBM50292332
Substrate/Competitorn/a
Meas. Tech.ChEMBL_840308 (CHEMBL2091265)
IC50 93300±n/a nM
Citation Villalta-Romero, FGortat, AHerrera, AEArguedas, RQuesada, Jde Melo, RLCalvete, JJMontero, MMurillo, RRucavado, AGutiérrez, JMPérez-Payá, E Identification of new snake venom metalloproteinase inhibitors using compound screening and rational Peptide design. ACS Med Chem Lett3:540-543 (2012) 
 
Snake venom metalloproteinase BaP1
Name:Snake venom metalloproteinase BaP1
Type:PROTEIN
Mol. Mass.:45929.07
Organism:Bothrops asper
Description:ChEMBL_840308
Residue:408
BDBM50292332
NameBDBM50292332
Synonyms:2,3,9,10-Tetramethoxy-5,6-dihydro-isoquino[3,2-a]isoquinolinylium; chloride CHEMBL1270849 CHEMBL274189 PALMATINE
TypeSmall organic molecule
Emp. Form.C21H22NO4
Mol. Mass.352.4031
SMILESCOc1cc2CC[n+]3cc4c(OC)c(OC)ccc4cc3-c2cc1OC