Reaction Details
TargetSnake venom metalloproteinase BaP1
LigandBDBM50420352
Substrate/Competitorn/a
Meas. Tech.ChEMBL_840308 (CHEMBL2091265)
IC50 216600±n/a nM
Citation Villalta-Romero, FGortat, AHerrera, AEArguedas, RQuesada, Jde Melo, RLCalvete, JJMontero, MMurillo, RRucavado, AGutiérrez, JMPérez-Payá, E Identification of new snake venom metalloproteinase inhibitors using compound screening and rational Peptide design. ACS Med Chem Lett3:540-543 (2012) 
 
Snake venom metalloproteinase BaP1
Name:Snake venom metalloproteinase BaP1
Type:PROTEIN
Mol. Mass.:45929.07
Organism:Bothrops asper
Description:ChEMBL_840308
Residue:408
BDBM50420352
NameBDBM50420352
Synonyms:CHEMBL2089169
TypeSmall organic molecule
Emp. Form.C23H36N8O4
Mol. Mass.488.5831
SMILESCC(C)C[C@H](NC(=O)[C@@H](N)Cc1c[nH]c2ccccc12)C(=O)N[C@@H](CCCN=C(N)N)C(=O)NO