Reaction Details
TargetSnake venom metalloproteinase BaP1
LigandBDBM50420354
Substrate/Competitorn/a
Meas. Tech.ChEMBL_840308 (CHEMBL2091265)
IC50>1000000±n/a nM
Citation Villalta-Romero, FGortat, AHerrera, AEArguedas, RQuesada, Jde Melo, RLCalvete, JJMontero, MMurillo, RRucavado, AGutiérrez, JMPérez-Payá, E Identification of new snake venom metalloproteinase inhibitors using compound screening and rational Peptide design. ACS Med Chem Lett3:540-543 (2012) 
 
Snake venom metalloproteinase BaP1
Name:Snake venom metalloproteinase BaP1
Type:PROTEIN
Mol. Mass.:45929.07
Organism:Bothrops asper
Description:ChEMBL_840308
Residue:408
BDBM50420354
NameBDBM50420354
Synonyms:CHEMBL2089158
TypeSmall organic molecule
Emp. Form.C26H33N5O3
Mol. Mass.463.5719
SMILESCC(C)C[C@H](NC(=O)[C@@H](N)Cc1c[nH]c2ccccc12)C(=O)N[C@@H](Cc1ccccc1)C(N)=O