Reaction Details
TargetCaspase-3
LigandBDBM50420474
Substrate/Competitorn/a
Meas. Tech.ChEMBL_841029 (CHEMBL2091155)
IC50 3±n/a nM
Citation Prime, MEAndersen, OABarker, JJBrooks, MACheng, RKToogood-Johnson, ICourtney, SMBrookfield, FAYarnold, CJMarston, RWJohnson, PDJohnsen, SFPalfrey, JJVaidya, DErfan, SIchihara, OFelicetti, BPalan, SPedret-Dunn, ASchaertl, SSternberger, IEbneth, AScheel, AWinkler, DToledo-Sherman, LBeconi, MMacdonald, DMuñoz-Sanjuan, IDominguez, CWityak, J Discovery and structure-activity relationship of potent and selective covalent inhibitors of transglutaminase 2 for Huntington's disease. J Med Chem55:1021-46 (2012) 
 
Caspase-3
Name:Caspase-3
Type:Hydrolase; heterotetramer of two heterodimers
Mol. Mass.:31607.55
Organism:Homo sapiens (Human)
Description:n/a
Residue:277
BDBM50420474
NameBDBM50420474
Synonyms:CHEMBL2086889 | US9073941, 607
TypeSmall organic molecule
Emp. Form.C15H15N5O3
Mol. Mass.313.3113
SMILESCCn1nc(nc2c1nc(=O)n(C)c2=O)-c1ccc(OC)cc1